{"text_format":"3","workbook":"xlsx","n_sheets":8,"sheets":["附录C(投资规模)","附录C(用地规模)","附录C(信息咨询)","附录C(非差额累进)","附录C(工日单价)","附录D","附录E","工作内容"],"not_rendered":{"defined_names":3},"read":"whole","date_system":"1900"}

{"sheet":"附录C(投资规模)","index":0,"n_rows":20,"n_cols":9,"rows_kept":20,"merged":[[0,1,0,2],[0,3,0,4],[0,5,0,6],[1,1,1,2]]}
["预算编码","预算基数（C）",null,"基本工作基准预算（元）",null,"可选工作基准预算（元）"]
[null,"万元",null,"基准费率（‰）","最大金额（元)","基准费率（‰）","最大金额（元)"]
["C1-1",0,{"$f":"B4","v":100},10,{"v":0,"d":"0.00"},2,{"v":0,"d":"0.00"},0,{"$f":"H3&\":{ref:'\"&A3&\"',staLine:\"&B3&\",endLine:\"&C3&\",basic:{staPrice:\"&E3&\",rate:\"&D3/1000&\"},optional:{staPrice:\"&G3&\",rate:\"&F3/1000&\"}}\"","v":"0:{ref:'C1-1',staLine:0,endLine:100,basic:{staPrice:0,rate:0.01},optional:{staPrice:0,rate:0.002}}"}]
["C1-2",100,{"$f":"B5","v":300},8,{"$f":"IF(ISNUMBER(E2),E2+($B4-$B3)*D3*10,($B4-$B3)*D3*10)","v":{"v":10000,"d":"10,000.00"}},1.6,{"$f":"IF(ISNUMBER(G2),G2+($B4-$B3)*F3*10,($B4-$B3)*F3*10)","v":{"v":2000,"d":"2,000.00"}},1,{"$f":"H4&\":{ref:'\"&A4&\"',staLine:\"&B4&\",endLine:\"&C4&\",basic:{staPrice:\"&E4&\",rate:\"&D4/1000&\"},optional:{staPrice:\"&G4&\",rate:\"&F4/1000&\"}}\"","v":"1:{ref:'C1-2',staLine:100,endLine:300,basic:{staPrice:10000,rate:0.008},optional:{staPrice:2000,rate:0.0016}}"}]
["C1-3",300,500,5,{"$f":"IF(ISNUMBER(E4),E4+($B5-$B4)*D4*10,($B5-$B4)*D4*10)","v":{"v":26000,"d":"26,000.00"}},1,{"$f":"IF(ISNUMBER(G4),G4+($B5-$B4)*F4*10,($B5-$B4)*F4*10)","v":{"v":5200,"d":"5,200.00"}},2,"2:{ref:'C1-3',staLine:300,endLine:500,basic:{staPrice:26000,rate:0.005},optional:{staPrice:5200,rate:0.001}}"]
["C1-4",500,{"v":1000,"d":"1,000"},4,{"v":36000,"d":"36,000.00"},0.8,{"v":7200,"d":"7,200.00"},3,"3:{ref:'C1-4',staLine:500,endLine:1000,basic:{staPrice:36000,rate:0.004},optional:{staPrice:7200,rate:0.0008}}"]
["C1-5",{"v":1000,"d":"1,000"},{"v":5000,"d":"5,000"},3,{"v":56000,"d":"56,000.00"},0.6,{"v":11200,"d":"11,200.00"},4,"4:{ref:'C1-5',staLine:1000,endLine:5000,basic:{staPrice:56000,rate:0.003},optional:{staPrice:11200,rate:0.0006}}"]
["C1-6",{"v":5000,"d":"5,000"},{"v":10000,"d":"10,000"},2,{"v":176000,"d":"176,000.00"},0.4,{"v":35200,"d":"35,200.00"},5,"5:{ref:'C1-6',staLine:5000,endLine:10000,basic:{staPrice:176000,rate:0.002},optional:{staPrice:35200,rate:0.0004}}"]
["C1-7",{"v":10000,"d":"10,000"},{"v":30000,"d":"30,000"},1.6,{"v":276000,"d":"276,000.00"},0.32,{"v":55200,"d":"55,200.00"},6,"6:{ref:'C1-7',staLine:10000,endLine:30000,basic:{staPrice:276000,rate:0.0016},optional:{staPrice:55200,rate:0.00032}}"]
["C1-8",{"v":30000,"d":"30,000"},{"v":50000,"d":"50,000"},1.3,{"v":596000,"d":"596,000.00"},0.26,{"v":119200,"d":"119,200.00"},7,"7:{ref:'C1-8',staLine:30000,endLine:50000,basic:{staPrice:596000,rate:0.0013},optional:{staPrice:119200,rate:0.00026}}"]
{"$rows_left_out":11}
{"sheet":"附录C(用地规模)","index":1,"n_rows":9,"n_cols":9,"rows_kept":9,"merged":[[0,1,0,2],[0,3,0,4],[0,5,0,6],[1,1,1,2]]}
["预算编码","预算基数（S）",null,"基本工作基准预算（元）",null,"可选工作基准预算（元）"]
[null,"亩",null,"基准单价(元/亩)","最大金额（元)","基准单价(元/亩)","最大金额（元)"]
["C2-1",0,{"$f":"B4","v":50},200,{"v":0,"d":"0.00"},40,{"v":0,"d":"0.00"},0,{"$f":"H3&\":{ref:'\"&A3&\"',staLine:\"&B3&\",endLine:\"&C3&\",basic:{staPrice:\"&E3&\",rate:\"&D3&\"},optional:{staPrice:\"&G3&\",rate:\"&F3&\"}}\"","v":"0:{ref:'C2-1',staLine:0,endLine:50,basic:{staPrice:0,rate:200},optional:{staPrice:0,rate:40}}"}]
["C2-2",50,{"$f":"B5","v":100},160,{"$f":"IF(ISNUMBER(E2),E2+($B4-$B3)*D3,($B4-$B3)*D3)","v":{"v":10000,"d":"10,000.00"}},32,{"$f":"IF(ISNUMBER(G2),G2+($B4-$B3)*F3,($B4-$B3)*F3)","v":{"v":2000,"d":"2,000.00"}},1,"1:{ref:'C2-2',staLine:50,endLine:100,basic:{staPrice:10000,rate:160},optional:{staPrice:2000,rate:32}}"]
["C2-3",100,{"$f":"B6","v":500},120,{"$f":"IF(ISNUMBER(E4),E4+($B5-$B4)*D4,($B5-$B4)*D4)","v":{"v":18000,"d":"18,000.00"}},24,{"$f":"IF(ISNUMBER(G4),G4+($B5-$B4)*F4,($B5-$B4)*F4)","v":{"v":3600,"d":"3,600.00"}},2,"2:{ref:'C2-3',staLine:100,endLine:500,basic:{staPrice:18000,rate:120},optional:{staPrice:3600,rate:24}}"]
["C2-4",500,{"$f":"B7","v":{"v":1000,"d":"1,000"}},80,{"$f":"IF(ISNUMBER(E5),E5+($B6-$B5)*D5,($B6-$B5)*D5)","v":{"v":66000,"d":"66,000.00"}},16,{"$f":"IF(ISNUMBER(G5),G5+($B6-$B5)*F5,($B6-$B5)*F5)","v":{"v":13200,"d":"13,200.00"}},3,"3:{ref:'C2-4',staLine:500,endLine:1000,basic:{staPrice:66000,rate:80},optional:{staPrice:13200,rate:16}}"]
["C2-5",{"v":1000,"d":"1,000"},{"$f":"B8","v":{"v":5000,"d":"5,000"}},60,{"$f":"IF(ISNUMBER(E6),E6+($B7-$B6)*D6,($B7-$B6)*D6)","v":{"v":106000,"d":"106,000.00"}},12,{"$f":"IF(ISNUMBER(G6),G6+($B7-$B6)*F6,($B7-$B6)*F6)","v":{"v":21200,"d":"21,200.00"}},4,"4:{ref:'C2-5',staLine:1000,endLine:5000,basic:{staPrice:106000,rate:60},optional:{staPrice:21200,rate:12}}"]
["C2-6",{"v":5000,"d":"5,000"},"null",20,{"$f":"IF(ISNUMBER(E7),E7+($B8-$B7)*D7,($B8-$B7)*D7)","v":{"v":346000,"d":"346,000.00"}},4,{"$f":"IF(ISNUMBER(G7),G7+($B8-$B7)*F7,($B8-$B7)*F7)","v":{"v":69200,"d":"69,200.00"}},5,"5:{ref:'C2-6',staLine:5000,endLine:null,basic:{staPrice:346000,rate:20},optional:{staPrice:69200,rate:4}}"]
[{"$nulls":8},{"$f":"\"{\"&_xlfn.TEXTJOIN(\",\",TRUE,I3:I8)&\",}\"","v":"{0:{ref:'C2-1',staLine:0,endLine:50,basic:{staPrice:0,rate:200},optional:{staPrice:0,rate:40}},1:{ref:'C2-2',staLine:50,endLine:100,basic:{staPrice:10000,rate:160},optional:{staPrice:2000,rate:32}},2:{ref:'C2-3',staLine:100,endLine:500,basic:{staPrice:18000,rate:120},optional:{staPrice:3600,rate:24}},3:{ref:'C2-4',staLine:500,endLine:1000,basic:{staPrice:66000,rate:80},optional:{staPrice:13200,rate:16}},4:{ref:'C2-5',staLine:1000,endLine:5000,basic:{staPrice:106000,rate:60},optional:{staPrice:21200,rate:12}},5:{ref:'C2-6',staLine:5000,endLine:null,basic:{staPrice:346000,rate:20},optional:{staPrice:69200,rate:4}},}"}]

{"sheet":"附录C(信息咨询)","index":2,"n_rows":8,"n_cols":7,"rows_kept":8,"merged":[[0,1,0,2],[0,3,0,4],[1,1,1,2]]}
["预算编码","预算基数（C）",null,"基本工作基准预算（元）"]
[null,"条",null,"基准单价(元/条)","最大金额（元)"]
["C8-1",0,{"$f":"B4","v":10},500,{"v":0,"d":"0.00"},0,{"$f":"F3&\":{ref:'\"&A3&\"',staLine:\"&B3&\",endLine:\"&C3&\",staPrice:\"&E3&\",rate:\"&D3&\"}\"","v":"0:{ref:'C8-1',staLine:0,endLine:10,staPrice:0,rate:500}"}]
["C8-2",10,{"$f":"B5","v":30},400,{"$f":"IF(ISNUMBER(E2),E2+($B4-$B3)*D3,($B4-$B3)*D3)","v":{"v":5000,"d":"5,000.00"}},1,{"$f":"F4&\":{ref:'\"&A4&\"',staLine:\"&B4&\",endLine:\"&C4&\",staPrice:\"&E4&\",rate:\"&D4&\"}\"","v":"1:{ref:'C8-2',staLine:10,endLine:30,staPrice:5000,rate:400}"}]
["C8-3",30,{"$f":"B6","v":50},300,{"$f":"IF(ISNUMBER(E4),E4+($B5-$B4)*D4,($B5-$B4)*D4)","v":{"v":13000,"d":"13,000.00"}},2,{"$f":"F5&\":{ref:'\"&A5&\"',staLine:\"&B5&\",endLine:\"&C5&\",staPrice:\"&E5&\",rate:\"&D5&\"}\"","v":"2:{ref:'C8-3',staLine:30,endLine:50,staPrice:13000,rate:300}"}]
["C8-4",50,{"$f":"B7","v":100},200,{"$f":"IF(ISNUMBER(E5),E5+($B6-$B5)*D5,($B6-$B5)*D5)","v":{"v":19000,"d":"19,000.00"}},3,{"$f":"F6&\":{ref:'\"&A6&\"',staLine:\"&B6&\",endLine:\"&C6&\",staPrice:\"&E6&\",rate:\"&D6&\"}\"","v":"3:{ref:'C8-4',staLine:50,endLine:100,staPrice:19000,rate:200}"}]
["C8-5",100,"null",100,{"$f":"IF(ISNUMBER(E6),E6+($B7-$B6)*D6,($B7-$B6)*D6)","v":{"v":29000,"d":"29,000.00"}},4,{"$f":"F7&\":{ref:'\"&A7&\"',staLine:\"&B7&\",endLine:\"&C7&\",staPrice:\"&E7&\",rate:\"&D7&\"}\"","v":"4:{ref:'C8-5',staLine:100,endLine:null,staPrice:29000,rate:100}"}]
[{"$nulls":6},{"$f":"\"{\"&_xlfn.TEXTJOIN(\",\",TRUE,G3:G7)&\",}\"","v":"{0:{ref:'C8-1',staLine:0,endLine:10,staPrice:0,rate:500},1:{ref:'C8-2',staLine:10,endLine:30,staPrice:5000,rate:400},2:{ref:'C8-3',staLine:30,endLine:50,staPrice:13000,rate:300},3:{ref:'C8-4',staLine:50,endLine:100,staPrice:19000,rate:200},4:{ref:'C8-5',staLine:100,endLine:null,staPrice:29000,rate:100},}"}]

{"sheet":"附录C(非差额累进)","index":3,"n_rows":45,"n_cols":13,"rows_kept":45}
[15,"C4-1","工程造价日常顾问","服务月份数",null,true,0.3,0.5,0.4,"万元/月",10000,{"$f":"ROW()-1","v":0},{"$f":"L1&\":{serviceID:\"&A1&\",ref:'\"&B1&\"',name:'\"&C1&\"',basicParam:'\"&D1&\"',required:\"&F1&\",unit:'\"&J1&\"',conversion:\"&K1&\",maxPrice:\"&H1&\",minPrice:\"&G1&\",defPrice:\"&I1&\",desc:'\"&E1&\"'}\"","v":"0:{serviceID:15,ref:'C4-1',name:'工程造价日常顾问',basicParam:'服务月份数',required:TRUE,unit:'万元/月',conversion:10000,maxPrice:0.5,minPrice:0.3,defPrice:0.4,desc:''}"}]
[15,"C4-2","工程造价专项顾问","服务项目的造价金额","适用于涉及造价费用类的顾问",true,"null","null",0.01,"%",0.01,{"$f":"ROW()-1","v":1},{"$f":"L2&\":{serviceID:\"&A2&\",ref:'\"&B2&\"',name:'\"&C2&\"',basicParam:'\"&D2&\"',required:\"&F2&\",unit:'\"&J2&\"',conversion:\"&K2&\",maxPrice:\"&H2&\",minPrice:\"&G2&\",defPrice:\"&I2&\",desc:'\"&E2&\"'}\"","v":"1:{serviceID:15,ref:'C4-2',name:'工程造价专项顾问',basicParam:'服务项目的造价金额',required:TRUE,unit:'%',conversion:0.01,maxPrice:null,minPrice:null,defPrice:0.01,desc:'适用于涉及造价费用类的顾问'}"}]
[16,"C5-1","组织与调研工作","调研次数",null,true,1,2,{"$f":"AVERAGE(G3:H3)","v":1.5},"万元/次",10000,2,"2:{serviceID:16,ref:'C5-1',name:'组织与调研工作',basicParam:'调研次数',required:TRUE,unit:'万元/次',conversion:10000,maxPrice:2,minPrice:1,defPrice:1.5,desc:''}"]
[16,"C5-2-1","文件编写工作","文件份数","主编",true,3,5,4,"万元/份",10000,3,"3:{serviceID:16,ref:'C5-2-1',name:'文件编写工作',basicParam:'文件份数',required:TRUE,unit:'万元/份',conversion:10000,maxPrice:5,minPrice:3,defPrice:4,desc:'主编'}"]
[16,"C5-2-2","文件编写工作","文件份数","参编",true,1,3,2,"万元/份",10000,4,"4:{serviceID:16,ref:'C5-2-2',name:'文件编写工作',basicParam:'文件份数',required:TRUE,unit:'万元/份',conversion:10000,maxPrice:3,minPrice:1,defPrice:2,desc:'参编'}"]
[16,"C5-3-1","评审工作","评审次数","大型评审",false,8,20,14,"万元/次",10000,5,"5:{serviceID:16,ref:'C5-3-1',name:'评审工作',basicParam:'评审次数',required:FALSE,unit:'万元/次',conversion:10000,maxPrice:20,minPrice:8,defPrice:14,desc:'大型评审'}"]
[16,"C5-3-2","评审工作","评审次数","中型评审",false,5,10,7.5,"万元/次",10000,6,"6:{serviceID:16,ref:'C5-3-2',name:'评审工作',basicParam:'评审次数',required:FALSE,unit:'万元/次',conversion:10000,maxPrice:10,minPrice:5,defPrice:7.5,desc:'中型评审'}"]
[16,"C5-3-3","评审工作","评审次数","小型评审",false,3,6,4.5,"万元/次",10000,7,"7:{serviceID:16,ref:'C5-3-3',name:'评审工作',basicParam:'评审次数',required:FALSE,unit:'万元/次',conversion:10000,maxPrice:6,minPrice:3,defPrice:4.5,desc:'小型评审'}"]
[17,"C6-1","组织与调研工作","调研次数",null,true,1,2,1.5,"万元/次",10000,8,"8:{serviceID:17,ref:'C6-1',name:'组织与调研工作',basicParam:'调研次数',required:TRUE,unit:'万元/次',conversion:10000,maxPrice:2,minPrice:1,defPrice:1.5,desc:''}"]
[17,"C6-2-1","研究及编写报告","文件份数","国家级",true,20,50,35,"万元/份",10000,9,"9:{serviceID:17,ref:'C6-2-1',name:'研究及编写报告',basicParam:'文件份数',required:TRUE,unit:'万元/份',conversion:10000,maxPrice:50,minPrice:20,defPrice:35,desc:'国家级'}"]
{"$rows_left_out":36}
{"sheet":"附录C(工日单价)","index":4,"n_rows":9,"n_cols":8,"rows_kept":9}
["C9-1-1","技术员及其他",600,800,{"$f":"AVERAGE(C1:D1)","v":700},2.3,0,{"$f":"G1&\":{ref:'\"&A1&\"',name:'\"&B1&\"',maxPrice:\"&D1&\",minPrice:\"&C1&\",defPrice:\"&E1&\",manageCoe:\"&F1&\"}\"","v":"0:{ref:'C9-1-1',name:'技术员及其他',maxPrice:800,minPrice:600,defPrice:700,manageCoe:2.3}"}]
["C9-1-2","助理工程师",800,1000,{"$f":"AVERAGE(C2:D2)","v":900},2.3,1,{"$f":"G2&\":{ref:'\"&A2&\"',name:'\"&B2&\"',maxPrice:\"&D2&\",minPrice:\"&C2&\",defPrice:\"&E2&\",manageCoe:\"&F2&\"}\"","v":"1:{ref:'C9-1-2',name:'助理工程师',maxPrice:1000,minPrice:800,defPrice:900,manageCoe:2.3}"}]
["C9-1-3","中级工程师或二级造价工程师",1000,1500,1250,2.2,2,"2:{ref:'C9-1-3',name:'中级工程师或二级造价工程师',maxPrice:1500,minPrice:1000,defPrice:1250,manageCoe:2.2}"]
["C9-1-4","高级工程师或一级造价工程师",1500,1800,1650,2.1,3,"3:{ref:'C9-1-4',name:'高级工程师或一级造价工程师',maxPrice:1800,minPrice:1500,defPrice:1650,manageCoe:2.1}"]
["C9-1-5","正高级工程师或资深专家",2000,2500,2250,2,4,"4:{ref:'C9-1-5',name:'正高级工程师或资深专家',maxPrice:2500,minPrice:2000,defPrice:2250,manageCoe:2}"]
["C9-2-1","二级造价工程师且具备中级工程师资格",1200,1500,1350,2.2,5,"5:{ref:'C9-2-1',name:'二级造价工程师且具备中级工程师资格',maxPrice:1500,minPrice:1200,defPrice:1350,manageCoe:2.2}"]
["C9-3-1","一级造价工程师且具备中级工程师资格",1500,1800,1650,2.1,6,"6:{ref:'C9-3-1',name:'一级造价工程师且具备中级工程师资格',maxPrice:1800,minPrice:1500,defPrice:1650,manageCoe:2.1}"]
["C9-3-2","一级造价工程师且具备高级工程师资格",1800,2000,1900,2.05,7,"7:{ref:'C9-3-2',name:'一级造价工程师且具备高级工程师资格',maxPrice:2000,minPrice:1800,defPrice:1900,manageCoe:2.05}"]
[{"$nulls":7},{"$f":"\"{\"&_xlfn.TEXTJOIN(\",\",TRUE,H1:H8)&\",}\"","v":"{0:{ref:'C9-1-1',name:'技术员及其他',maxPrice:800,minPrice:600,defPrice:700,manageCoe:2.3},1:{ref:'C9-1-2',name:'助理工程师',maxPrice:1000,minPrice:800,defPrice:900,manageCoe:2.3},2:{ref:'C9-1-3',name:'中级工程师或二级造价工程师',maxPrice:1500,minPrice:1000,defPrice:1250,manageCoe:2.2},3:{ref:'C9-1-4',name:'高级工程师或一级造价工程师',maxPrice:1800,minPrice:1500,defPrice:1650,manageCoe:2.1},4:{ref:'C9-1-5',name:'正高级工程师或资深专家',maxPrice:2500,minPrice:2000,defPrice:2250,manageCoe:2},5:{ref:'C9-2-1',name:'二级造价工程师且具备中级工程师资格',maxPrice:1500,minPrice:1200,defPrice:1350,manageCoe:2.2},6:{ref:'C9-3-1',name:'一级造价工程师且具备中级工程师资格',maxPrice:1800,minPrice:1500,defPrice:1650,manageCoe:2.1},7:{ref:'C9-3-2',name:'一级造价工程师且具备高级工程师资格',maxPrice:2000,minPrice:1800,defPrice:1900,manageCoe:2.05},}"}]

{"sheet":"附录D","index":5,"n_rows":39,"n_cols":17,"rows_kept":39}
[{"$nulls":6},"id","order","scale","onlyCostScale","amount","workDay","isRoad","isRailway","isWaterway","mutiple"]
["D1","全过程造价咨询","null","null",1,null,{"$f":"ROW()-2","v":0},{"$f":"ROW()-1","v":1},true,true,false,true,true,true,true,false,{"$f":"G2&\":{ref:'\"&A2&\"',name:'\"&B2&\"',maxCoe:\"&D2&\",minCoe:\"&C2&\",defCoe:\"&E2&\",desc:'\"&F2&\"',isRoad:\"&M2&\",isRailway:\"&N2&\",isWaterway:\"&O2&\",mutiple:\"&P2&\",order:\"&H2&\",scale:\"&I2&\",onlyCostScale:\"&J2&\",amount:\"&K2&\",workDay:\"&L2&\"}\"","v":"0:{ref:'D1',name:'全过程造价咨询',maxCoe:null,minCoe:null,defCoe:1,desc:'',isRoad:TRUE,isRailway:TRUE,isWaterway:TRUE,mutiple:FALSE,order:1,scale:TRUE,onlyCostScale:TRUE,amount:FALSE,workDay:TRUE}"}]
["D2","分阶段造价咨询","null","null","null",null,{"$f":"ROW()-2","v":1},{"$f":"ROW()-1","v":2},"null","null","null","null",true,true,true,false,"1:{ref:'D2',name:'分阶段造价咨询',maxCoe:null,minCoe:null,defCoe:null,desc:'',isRoad:TRUE,isRailway:TRUE,isWaterway:TRUE,mutiple:FALSE,order:2,scale:null,onlyCostScale:null,amount:null,workDay:null}"]
["D2-1","前期阶段造价咨询","null","null",0.5,null,2,3,true,true,false,true,true,true,true,false,"2:{ref:'D2-1',name:'前期阶段造价咨询',maxCoe:null,minCoe:null,defCoe:0.5,desc:'',isRoad:TRUE,isRailway:TRUE,isWaterway:TRUE,mutiple:FALSE,order:3,scale:TRUE,onlyCostScale:TRUE,amount:FALSE,workDay:TRUE}"]
["D2-2-1","实施阶段造价咨询（公路、水运）","null","null",0.55,"本系数适用于公路和水运工程。",3,4,true,true,false,true,true,false,true,false,"3:{ref:'D2-2-1',name:'实施阶段造价咨询（公路、水运）',maxCoe:null,minCoe:null,defCoe:0.55,desc:'本系数适用于公路和水运工程。',isRoad:TRUE,isRailway:FALSE,isWaterway:TRUE,mutiple:FALSE,order:4,scale:TRUE,onlyCostScale:TRUE,amount:FALSE,workDay:TRUE}"]
["D2-2-2","实施阶段造价咨询（铁路）","null","null",0.6,"本系数适用于铁路工程。",4,5,true,true,false,true,false,true,false,false,"4:{ref:'D2-2-2',name:'实施阶段造价咨询（铁路）',maxCoe:null,minCoe:null,defCoe:0.6,desc:'本系数适用于铁路工程。',isRoad:FALSE,isRailway:TRUE,isWaterway:FALSE,mutiple:FALSE,order:5,scale:TRUE,onlyCostScale:TRUE,amount:FALSE,workDay:TRUE}"]
["D3","基本造价咨询","null","null","null",null,5,6,"null","null","null","null",true,true,true,false,"5:{ref:'D3',name:'基本造价咨询',maxCoe:null,minCoe:null,defCoe:null,desc:'',isRoad:TRUE,isRailway:TRUE,isWaterway:TRUE,mutiple:FALSE,order:6,scale:null,onlyCostScale:null,amount:null,workDay:null}"]
["D3-1","投资估算","null","null",0.1,"委托同一咨询人同时负责D3-1和D3-2时，D3-1和D3-2的合计调整系数为0.25。",6,7,true,true,false,true,true,true,true,false,"6:{ref:'D3-1',name:'投资估算',maxCoe:null,minCoe:null,defCoe:0.1,desc:'委托同一咨询人同时负责D3-1和D3-2时，D3-1和D3-2的合计调整系数为0.25。',isRoad:TRUE,isRailway:TRUE,isWaterway:TRUE,mutiple:FALSE,order:7,scale:TRUE,onlyCostScale:TRUE,amount:FALSE,workDay:TRUE}"]
["D3-2","设计概算","null","null",0.2,null,7,8,true,true,false,true,true,true,true,false,"7:{ref:'D3-2',name:'设计概算',maxCoe:null,minCoe:null,defCoe:0.2,desc:'',isRoad:TRUE,isRailway:TRUE,isWaterway:TRUE,mutiple:FALSE,order:8,scale:TRUE,onlyCostScale:TRUE,amount:FALSE,workDay:TRUE}"]
["D3-3","施工图预算","null","null",0.25,"委托同一咨询人同时负责D3-3和D3-4时，D3-3和D3-4的合计调整系数为0.3。",8,9,true,false,false,true,true,true,true,false,"8:{ref:'D3-3',name:'施工图预算',maxCoe:null,minCoe:null,defCoe:0.25,desc:'委托同一咨询人同时负责D3-3和D3-4时，D3-3和D3-4的合计调整系数为0.3。',isRoad:TRUE,isRailway:TRUE,isWaterway:TRUE,mutiple:FALSE,order:9,scale:TRUE,onlyCostScale:FALSE,amount:FALSE,workDay:TRUE}"]
{"$rows_left_out":30}
{"sheet":"附录E","index":6,"n_rows":36,"n_cols":12,"rows_kept":36}
[{"$nulls":6},"hasCost","hasArea","isRoad","isRailway","isWaterway"]
["E1","交通运输工程通用专业","null",null,{"$f":"ROW()-2","v":0},{"$f":"ROW()-1","v":1},false,false,true,true,true,{"$f":"E2&\":{ref:'\"&A2&\"',name:'\"&B2&\"',maxCoe:null,minCoe:null,defCoe:\"&C2&\",desc:'\"&D2&\"',isRoad:\"&I2&\",isRailway:\"&J2&\",isWaterway:\"&K2&\",order:\"&F2&\",hasCost:\"&G2&\",hasArea:\"&H2&\"}\"","v":"0:{ref:'E1',name:'交通运输工程通用专业',maxCoe:null,minCoe:null,defCoe:null,desc:'',isRoad:TRUE,isRailway:TRUE,isWaterway:TRUE,order:1,hasCost:FALSE,hasArea:FALSE}"}]
["E1-1","征地（用海）补偿",1,"适用于交通建设项目征地（用海）补偿的施工图预算、招标工程量清单及清单预算（或最高投标限价）、清理概算（仅限铁路工程）、合同（工程）结算和造价鉴定、计算工程量、工程变更费用咨询、工程成本测（核）算",{"$f":"ROW()-2","v":1},{"$f":"ROW()-1","v":2},true,true,true,true,true,{"$f":"E3&\":{ref:'\"&A3&\"',name:'\"&B3&\"',maxCoe:null,minCoe:null,defCoe:\"&C3&\",desc:'\"&D3&\"',isRoad:\"&I3&\",isRailway:\"&J3&\",isWaterway:\"&K3&\",order:\"&F3&\",hasCost:\"&G3&\",hasArea:\"&H3&\"}\"","v":"1:{ref:'E1-1',name:'征地（用海）补偿',maxCoe:null,minCoe:null,defCoe:1,desc:'适用于交通建设项目征地（用海）补偿的施工图预算、招标工程量清单及清单预算（或最高投标限价）、清理概算（仅限铁路工程）、合同（工程）结算和造价鉴定、计算工程量、工程变更费用咨询、工程成本测（核）算',isRoad:TRUE,isRailway:TRUE,isWaterway:TRUE,order:2,hasCost:TRUE,hasArea:TRUE}"}]
["E1-2","拆迁补偿",2.5,"适用于交通建设项目拆迁补偿的施工图预算、招标工程量清单及清单预算（或最高投标限价）、清理概算（仅限铁路工程）、合同（工程）结算和造价鉴定、计算工程量、工程变更费用咨询、工程成本测（核）算",2,3,true,true,true,true,true,"2:{ref:'E1-2',name:'拆迁补偿',maxCoe:null,minCoe:null,defCoe:2.5,desc:'适用于交通建设项目拆迁补偿的施工图预算、招标工程量清单及清单预算（或最高投标限价）、清理概算（仅限铁路工程）、合同（工程）结算和造价鉴定、计算工程量、工程变更费用咨询、工程成本测（核）算',isRoad:TRUE,isRailway:TRUE,isWaterway:TRUE,order:3,hasCost:TRUE,hasArea:TRUE}"]
["E1-3","迁改工程",2,"适用于交通建设项目迁改工程的施工图预算、招标工程量清单及清单预算（或最高投标限价）、清理概算（仅限铁路工程）、合同（工程）结算和造价鉴定、计算工程量、工程变更费用咨询、工程成本测（核）算",3,4,true,false,true,true,true,"3:{ref:'E1-3',name:'迁改工程',maxCoe:null,minCoe:null,defCoe:2,desc:'适用于交通建设项目迁改工程的施工图预算、招标工程量清单及清单预算（或最高投标限价）、清理概算（仅限铁路工程）、合同（工程）结算和造价鉴定、计算工程量、工程变更费用咨询、工程成本测（核）算',isRoad:TRUE,isRailway:TRUE,isWaterway:TRUE,order:4,hasCost:TRUE,hasArea:FALSE}"]
["E1-4","工程建设其他费",1,"适用于交通建设项目的工程建设其他费的施工图预算、招标工程量清单及清单预算（或最高投标限价）、清理概算（仅限铁路工程）和造价鉴定、计算工程量、工程变更费用咨询、工程成本测（核）算",4,5,true,false,true,true,true,"4:{ref:'E1-4',name:'工程建设其他费',maxCoe:null,minCoe:null,defCoe:1,desc:'适用于交通建设项目的工程建设其他费的施工图预算、招标工程量清单及清单预算（或最高投标限价）、清理概算（仅限铁路工程）和造价鉴定、计算工程量、工程变更费用咨询、工程成本测（核）算',isRoad:TRUE,isRailway:TRUE,isWaterway:TRUE,order:5,hasCost:TRUE,hasArea:FALSE}"]
["E1-5","预备费",1,null,5,6,true,false,true,true,true,"5:{ref:'E1-5',name:'预备费',maxCoe:null,minCoe:null,defCoe:1,desc:'',isRoad:TRUE,isRailway:TRUE,isWaterway:TRUE,order:6,hasCost:TRUE,hasArea:FALSE}"]
["E1-6","建设期贷款利息",1,null,6,7,true,false,true,true,true,"6:{ref:'E1-6',name:'建设期贷款利息',maxCoe:null,minCoe:null,defCoe:1,desc:'',isRoad:TRUE,isRailway:TRUE,isWaterway:TRUE,order:7,hasCost:TRUE,hasArea:FALSE}"]
["E2","公路工程专业",1,"适用于公路工程的全过程造价咨询、分阶段造价咨询、投资估算、初步设计概算、竣工决算和调整估算、调整概算（含征地拆迁和工程建设其他费）",7,8,false,false,true,false,false,"7:{ref:'E2',name:'公路工程专业',maxCoe:null,minCoe:null,defCoe:1,desc:'适用于公路工程的全过程造价咨询、分阶段造价咨询、投资估算、初步设计概算、竣工决算和调整估算、调整概算（含征地拆迁和工程建设其他费）',isRoad:TRUE,isRailway:FALSE,isWaterway:FALSE,order:8,hasCost:FALSE,hasArea:FALSE}"]
["E2-1","临时工程",1,"适用于临时工程专业的施工图预算、招标工程量清单及清单预算（或最高投标限价）、合同（工程）结算和造价鉴定、计算工程量、工程变更费用咨询、工程成本测（核）算",8,9,true,false,true,false,false,"8:{ref:'E2-1',name:'临时工程',maxCoe:null,minCoe:null,defCoe:1,desc:'适用于临时工程专业的施工图预算、招标工程量清单及清单预算（或最高投标限价）、合同（工程）结算和造价鉴定、计算工程量、工程变更费用咨询、工程成本测（核）算',isRoad:TRUE,isRailway:FALSE,isWaterway:FALSE,order:9,hasCost:TRUE,hasArea:FALSE}"]
{"$rows_left_out":27}
{"sheet":"工作内容","index":7,"n_rows":193,"n_cols":9,"rows_kept":193,"merged":[[0,0,0,3]]}
["交通运输工程造价咨询服务工作内容",{"$nulls":3},"id","serviceid","order","type"]
["序号","工作内容","工作类型","备注"]
[1,"通用工作【适用于投资估算、设计概算、施工图预算、招标工程量清单及清单预算、清理概算、合同（工程）结算、竣工决算；造价政策制（修）订、造价科学与技术研究、定额测定、造价信息咨询、造价鉴定、工程成本测算、工程成本核算、计算工程量、工程变更费用咨询、调整估算、调整概算、造价检查。"]
[1.1,"收集并整理各阶段及各项造价咨询所需的基础资料，审核基础资料的完整性和合理性","基本工作","放在工作内容的第1项"]
[1.2,"编制造价咨询服务总体及各分项的服务计划、服务大纲及工作方案","基本工作","放在工作内容的第1项"]
[1.3,"了解建设工程项目所在地的建设条件","基本工作","放在工作内容的第1项"]
[2,"投资估算",null,null,-1,{"$f":"IF(LEN(C7)>0,F6,INDEX(附录D!G:G,MATCH(B7,附录D!B:B,0)))","v":6},null,null,{"$f":"IF(LEN(C7)>0,E7&\":{text:'\"&B7&\"',serviceid:\"&F7&\",order:\"&G7&\",type:\"&H7&\"}\",\"\")","v":""}]
[2.1,"完成投资估算文件及主要技术经济指标，完成与相关单位核对投资估算","基本工作",null,{"$f":"IF(LEN(C8)>0,E7+1,E7)","v":0},{"$f":"IF(LEN(C8)>0,F7,INDEX(附录D!G:G,MATCH(B8,附录D!B:B,0)))","v":6},1,0,{"$f":"IF(LEN(C8)>0,E8&\":{text:'\"&B8&\"',serviceid:\"&F8&\",order:\"&G8&\",type:\"&H8&\"}\",\"\")","v":"0:{text:'完成投资估算文件及主要技术经济指标，完成与相关单位核对投资估算',serviceid:6,order:1,type:0}"}]
[2.2,"根据项目建议书或可行性研究报告的变化，动态调整投资估算和技术经济指标，并对比各环节投资估算变化，完成项目建议书阶段到可行性研究阶段的量、价对比及原因分析","基本工作",null,{"$f":"IF(LEN(C9)>0,E8+1,E8)","v":1},{"$f":"IF(LEN(C9)>0,F8,INDEX(附录D!G:G,MATCH(B9,附录D!B:B,0)))","v":6},2,0,{"$f":"IF(LEN(C9)>0,E9&\":{text:'\"&B9&\"',serviceid:\"&F9&\",order:\"&G9&\",type:\"&H9&\"}\",\"\")","v":"1:{text:'根据项目建议书或可行性研究报告的变化，动态调整投资估算和技术经济指标，并对比各环节投资估算变化，完成项目建议书阶段到可行性研究阶段的量、价对比及原因分析',serviceid:6,order:2,type:0}"}]
[2.3,"参加项目建议书或可行性研究的技术论证会议、评审会议和与确定投资估算相关的会议","基本工作",null,2,{"$f":"IF(LEN(C10)>0,F9,INDEX(附录D!G:G,MATCH(B10,附录D!B:B,0)))","v":6},3,0,"2:{text:'参加项目建议书或可行性研究的技术论证会议、评审会议和与确定投资估算相关的会议',serviceid:6,order:3,type:0}"]
{"$rows_left_out":183}